[Date Prev][Date Next][Thread Prev][Thread Next][Date Index][Thread Index]

[Xen-devel] [xen-4.5-testing baseline-only test] 38615: regressions - FAIL

This run is configured for baseline tests only.

flight 38615 xen-4.5-testing real [real]

Regressions :-(

Tests which did not succeed and are blocking,
including tests which could not be run:
 test-amd64-amd64-pygrub      10 guest-start               fail REGR. vs. 38530

Regressions which are regarded as allowable (not blocking):
 test-amd64-i386-xl-qemuu-win7-amd64 13 guest-localmigrate fail REGR. vs. 38530
 test-amd64-amd64-xl-rtds      6 xen-boot                     fail   like 38530
 test-amd64-amd64-xl-credit2  19 guest-start/debian.repeat    fail   like 38530
 test-amd64-amd64-xl-qemuu-win7-amd64 15 guest-localmigrate/x10 fail like 38530
 test-amd64-amd64-xl-qemut-winxpsp3  9 windows-install          fail like 38530

Tests which did not succeed, but are not blocking:
 test-armhf-armhf-xl-vhd       9 debian-di-install            fail   never pass
 test-armhf-armhf-libvirt-qcow2  9 debian-di-install            fail never pass
 test-armhf-armhf-libvirt-raw  9 debian-di-install            fail   never pass
 test-armhf-armhf-libvirt     14 guest-saverestore            fail   never pass
 test-armhf-armhf-libvirt     12 migrate-support-check        fail   never pass
 test-amd64-amd64-xl-pvh-intel 11 guest-start                  fail  never pass
 test-amd64-amd64-rumpuserxen-amd64 15 
rumpuserxen-demo-xenstorels/xenstorels.repeat fail never pass
 test-amd64-amd64-xl-pvh-amd  11 guest-start                  fail   never pass
 test-armhf-armhf-xl-credit2  12 migrate-support-check        fail   never pass
 test-armhf-armhf-xl-credit2  13 saverestore-support-check    fail   never pass
 test-armhf-armhf-xl-multivcpu 13 saverestore-support-check    fail  never pass
 test-armhf-armhf-xl-multivcpu 12 migrate-support-check        fail  never pass
 test-armhf-armhf-xl-midway   12 migrate-support-check        fail   never pass
 test-armhf-armhf-xl-midway   13 saverestore-support-check    fail   never pass
 test-armhf-armhf-xl          13 saverestore-support-check    fail   never pass
 test-armhf-armhf-xl          12 migrate-support-check        fail   never pass
 test-armhf-armhf-xl-rtds     13 saverestore-support-check    fail   never pass
 test-armhf-armhf-xl-rtds     12 migrate-support-check        fail   never pass
 test-amd64-amd64-libvirt     12 migrate-support-check        fail   never pass
 test-amd64-i386-libvirt      12 migrate-support-check        fail   never pass
 test-amd64-amd64-libvirt-vhd 11 migrate-support-check        fail   never pass
 test-amd64-amd64-qemuu-nested-amd 16 debian-hvm-install/l1/l2  fail never pass
 test-amd64-amd64-xl-qemut-win7-amd64 16 guest-stop             fail never pass
 test-amd64-i386-xl-qemut-win7-amd64 16 guest-stop              fail never pass

version targeted for testing:
 xen                  ee576d71103e6795dc0add91db1b0d281eab1caf
baseline version:
 xen                  4c11414775a28ccd29a33c62cd89e202feb631d7

Last test of basis    38530  2015-12-17 18:55:32 Z   24 days
Testing same since    38615  2016-01-10 23:54:04 Z    0 days    1 attempts

People who touched revisions under test:
  Dario Faggioli <dario.faggioli@xxxxxxxxxx>
  Ian Campbell <ian.campbell@xxxxxxxxxx>
  Ian Jackson <ian.jackson@xxxxxxxxxxxxx>
  Jan Beulich <jbeulich@xxxxxxxx>
  Wei Liu <wei.liu2@xxxxxxxxxx>

 build-amd64                                                  pass    
 build-armhf                                                  pass    
 build-i386                                                   pass    
 build-amd64-libvirt                                          pass    
 build-armhf-libvirt                                          pass    
 build-i386-libvirt                                           pass    
 build-amd64-prev                                             pass    
 build-i386-prev                                              pass    
 build-amd64-pvops                                            pass    
 build-armhf-pvops                                            pass    
 build-i386-pvops                                             pass    
 build-amd64-rumpuserxen                                      pass    
 build-i386-rumpuserxen                                       pass    
 test-amd64-amd64-xl                                          pass    
 test-armhf-armhf-xl                                          pass    
 test-amd64-i386-xl                                           pass    
 test-amd64-amd64-qemuu-nested-amd                            fail    
 test-amd64-amd64-xl-pvh-amd                                  fail    
 test-amd64-i386-qemut-rhel6hvm-amd                           pass    
 test-amd64-i386-qemuu-rhel6hvm-amd                           pass    
 test-amd64-amd64-xl-qemut-debianhvm-amd64                    pass    
 test-amd64-i386-xl-qemut-debianhvm-amd64                     pass    
 test-amd64-amd64-xl-qemuu-debianhvm-amd64                    pass    
 test-amd64-i386-xl-qemuu-debianhvm-amd64                     pass    
 test-amd64-i386-freebsd10-amd64                              pass    
 test-amd64-amd64-xl-qemuu-ovmf-amd64                         pass    
 test-amd64-i386-xl-qemuu-ovmf-amd64                          pass    
 test-amd64-amd64-rumpuserxen-amd64                           fail    
 test-amd64-amd64-xl-qemut-win7-amd64                         fail    
 test-amd64-i386-xl-qemut-win7-amd64                          fail    
 test-amd64-amd64-xl-qemuu-win7-amd64                         fail    
 test-amd64-i386-xl-qemuu-win7-amd64                          fail    
 test-amd64-amd64-xl-credit2                                  fail    
 test-armhf-armhf-xl-credit2                                  pass    
 test-amd64-i386-freebsd10-i386                               pass    
 test-amd64-i386-rumpuserxen-i386                             pass    
 test-amd64-amd64-qemuu-nested-intel                          pass    
 test-amd64-amd64-xl-pvh-intel                                fail    
 test-amd64-i386-qemut-rhel6hvm-intel                         pass    
 test-amd64-i386-qemuu-rhel6hvm-intel                         pass    
 test-amd64-amd64-libvirt                                     pass    
 test-armhf-armhf-libvirt                                     fail    
 test-amd64-i386-libvirt                                      pass    
 test-armhf-armhf-xl-midway                                   pass    
 test-amd64-amd64-migrupgrade                                 pass    
 test-amd64-i386-migrupgrade                                  pass    
 test-amd64-amd64-xl-multivcpu                                pass    
 test-armhf-armhf-xl-multivcpu                                pass    
 test-amd64-amd64-pair                                        pass    
 test-amd64-i386-pair                                         pass    
 test-amd64-amd64-libvirt-pair                                pass    
 test-amd64-i386-libvirt-pair                                 pass    
 test-amd64-amd64-amd64-pvgrub                                pass    
 test-amd64-amd64-i386-pvgrub                                 pass    
 test-amd64-amd64-pygrub                                      fail    
 test-armhf-armhf-libvirt-qcow2                               fail    
 test-amd64-amd64-xl-qcow2                                    pass    
 test-armhf-armhf-libvirt-raw                                 fail    
 test-amd64-i386-xl-raw                                       pass    
 test-amd64-amd64-xl-rtds                                     fail    
 test-armhf-armhf-xl-rtds                                     pass    
 test-amd64-i386-xl-qemut-winxpsp3-vcpus1                     pass    
 test-amd64-i386-xl-qemuu-winxpsp3-vcpus1                     pass    
 test-amd64-amd64-libvirt-vhd                                 pass    
 test-armhf-armhf-xl-vhd                                      fail    
 test-amd64-amd64-xl-qemut-winxpsp3                           fail    
 test-amd64-i386-xl-qemut-winxpsp3                            pass    
 test-amd64-amd64-xl-qemuu-winxpsp3                           pass    
 test-amd64-i386-xl-qemuu-winxpsp3                            pass    

sg-report-flight on osstest.xs.citrite.net
logs: /home/osstest/logs
images: /home/osstest/images

Logs, config files, etc. are available at

Test harness code can be found at

Push not applicable.

commit ee576d71103e6795dc0add91db1b0d281eab1caf
Author: Wei Liu <wei.liu2@xxxxxxxxxx>
Date:   Wed Oct 14 12:41:13 2015 +0100

    Config.mk: update OVMF changeset
    Signed-off-by: Wei Liu <wei.liu2@xxxxxxxxxx>
    Acked-by: Ian Campbell <ian.campbell@xxxxxxxxxx>
    (cherry picked from commits 04c5efb0a141fa53e805e396970419436e74ce67
     and f046e501bbca1c8a46853b2e1f1b587e228c73de)
    Apropos of discussion in
     "OVMF related osstest failures on multiple branches"
    We believe the older ovmf.git does not work when built with the gcc in
    Debian jessie.  We do not know where this bug lies but we are fixing
    it by updating ovmf.
    We have decided that we are not in a position to review the changes to
    OVMF upstream, and ourselves decide what to cherry pick.  Instead we
    will update the revision wholesale and use the xen.git stable
    branches' push gate.
    Signed-off-by: Ian Jackson <ian.jackson@xxxxxxxxxxxxx>
    (cherry picked from commits 6c3c6ff9ecaa5ee0be8b535d36fdcd12380564a1
     and 1d3cc6e62c4d2fc3dd9251d4921881425c9d27bd)
    Signed-off-by: Ian Jackson <ian.jackson@xxxxxxxxxxxxx>

commit 845e8c1653242bbd9b9de5a081182db0f3f39054
Author: Dario Faggioli <dario.faggioli@xxxxxxxxxx>
Date:   Fri Jun 20 16:09:00 2014 +0200

    blktap: Fix two 'maybe uninitialized' variables
    [ Cross-ported to blktap1 from 345e44a85d71a
      "blktap2: Fix two 'maybe uninitialized' variables" -iwj;
      Remainder of commit message is from blktap2's version. ]
    for which gcc 4.9.0 complains about, like this:
    block-qcow.c: In function `get_cluster_offset':
    block-qcow.c:431:3: error: `tmp_ptr' may be used uninitialized in this 
       memcpy(tmp_ptr, l1_ptr, 4096);
    block-qcow.c:606:7: error: `tmp_ptr2' may be used uninitialized in this
    function [-Werror=maybe-uninitialized]
       if (write(s->fd, tmp_ptr2, 4096) != 4096) {
    cc1: all warnings being treated as errors
     recipe for target 'block-qcow.o' failed
    make[5]: *** [block-qcow.o] Error 1
    The proper behavior is to return upon allocation failure.
    About what to return, 0 seems the best option, looking
    at both the function and the call sites.
    Signed-off-by: Dario Faggioli <dario.faggioli@xxxxxxxxxx>
    Acked-by: Ian Jackson <ian.jackson@xxxxxxxxxxxxx>
    Backport-requested-by: Ian Campbell <ian.campbell@xxxxxxxxxx>
    Signed-off-by: Ian Jackson <ian.jackson@xxxxxxxxxxxxx>

commit 7b2ce457b8bbcf928f347fac3d2b111611e61e0a
Author: Ian Jackson <ian.jackson@xxxxxxxxxxxxx>
Date:   Mon Jan 4 15:36:12 2016 +0000

    QEMU_TAG update

commit 172797ecdfd4e2cfece6a401b7b000799534c84e
Author: Ian Jackson <ian.jackson@xxxxxxxxxxxxx>
Date:   Fri Dec 18 14:58:10 2015 +0000

    QEMU_TAG update

commit 880c29f5838f75764a7767ffbd51942439addbc9
Author: Jan Beulich <jbeulich@xxxxxxxx>
Date:   Thu Dec 17 14:29:28 2015 +0100

    x86/HVM: avoid reading ioreq state more than once
    Otherwise, especially when the compiler chooses to translate the
    switch() to a jump table, unpredictable behavior (and in the jump table
    case arbitrary code execution) can result.
    This is XSA-166.
    Signed-off-by: Jan Beulich <jbeulich@xxxxxxxx>
    Acked-by: Ian Campbell <ian.campbell@xxxxxxxxxx>
    master commit: b452430a4cdfc801fa4bc391aed7522365e1deb6
    master date: 2015-12-17 14:22:46 +0100

commit b45e5349ee747371d07d833afc9a6d5c9b68a0c6
Author: Jan Beulich <jbeulich@xxxxxxxx>
Date:   Thu Dec 17 14:28:58 2015 +0100

    x86: don't leak ST(n)/XMMn values to domains first using them
    FNINIT doesn't alter these registers, and hence using it is
    insufficient to initialize a guest's initial state.
    This is CVE-2015-8555 / XSA-165.
    Signed-off-by: Jan Beulich <jbeulich@xxxxxxxx>
    Reviewed-by: Andrew Cooper <andrew.cooper3@xxxxxxxxxx>
    master commit: 81818b3f277544535974204f8d840da86fa8a44f
    master date: 2015-12-17 14:22:13 +0100
(qemu changes not included)

Xen-devel mailing list



Lists.xenproject.org is hosted with RackSpace, monitoring our
servers 24x7x365 and backed by RackSpace's Fanatical Support®.