[Date Prev][Date Next][Thread Prev][Thread Next][Date Index][Thread Index]

Re: [Xen-devel] [xen-unstable test] 129468: regressions - FAIL

>>> On 07.11.18 at 22:46, <osstest-admin@xxxxxxxxxxxxxx> wrote:
> flight 129468 xen-unstable real [real]
> http://logs.test-lab.xenproject.org/osstest/logs/129468/ 
> Regressions :-(
> Tests which did not succeed and are blocking,
> including tests which could not be run:
>  test-amd64-i386-xl-qemuu-dmrestrict-amd64-dmrestrict 7 xen-boot fail REGR. 
> vs. 129426
>  build-amd64-xsm               6 xen-build                fail REGR. vs. 
> 129426

+ test -d git://cache:9419/git://xenbits.xen.org/qemu-xen-traditional.git
+ export GIT=git
d0d8ad39ecb51cd7497cd524484fe09f50876798 qemu-xen-traditional-dir
make[2]: *** No rule to make target 'osdep.c', needed by 'osdep.o'.  Stop.
  CC    cutils.o
gcc: error: cutils.c: No such file or directory
gcc: fatal error: no input files
compilation terminated.
make[2]: *** Waiting for unfinished jobs....
recipe for target 'cutils.o' failed
make[2]: Leaving directory 
make[2]: *** [cutils.o] Error 4
Makefile:466: recipe for target 'ioemu' failed
make[1]: *** [ioemu] Error 2
make[1]: *** Waiting for unfinished jobs....

A "glitch" with a git checkout? Odd that the script didn't log any error.


Xen-devel mailing list



Lists.xenproject.org is hosted with RackSpace, monitoring our
servers 24x7x365 and backed by RackSpace's Fanatical Support®.