[Date Prev][Date Next][Thread Prev][Thread Next][Date Index][Thread Index]

[Xen-users] Xen install make errors on Fedora Core 11!

  • To: xen-users@xxxxxxxxxxxxxxxxxxx
  • From: Jan Muhammad <janmuhd@xxxxxxxxx>
  • Date: Sun, 14 Mar 2010 20:00:34 +0000 (GMT)
  • Delivery-date: Sun, 14 Mar 2010 13:03:04 -0700
  • Domainkey-signature: a=rsa-sha1; q=dns; c=nofws; s=s1024; d=yahoo.com; h=Message-ID:X-YMail-OSG:Received:X-Mailer:Date:From:Subject:To:In-Reply-To:MIME-Version:Content-Type; b=fAUx1xlReT5U1l2aTVj75M5hpFxFaGNXEwSvtVRmXUjaJRRe5q7IpejdcXJ3gRMgFZjF4nvrQ/FfJvgc7OpDHY/m4gnuiOUU+jNWlmjkYVM3BTLqiNvgtgf2lks0M9nLNJTHC6l/00NoSBDg4f24gTJOh1DtTqDYw1OkKWBULQU=;
  • List-id: Xen user discussion <xen-users.lists.xensource.com>

Hi all,

I'm following this link
( http://bderzhavets.wordpress.com/2009/06/10/setup-fedora-11-pv-domu-at-xen-3-4-1-dom0-kernel-2-6-30-rc6-tip-on-top-of-fedora-11/) to install Xen 3.4 on Fedora Core with 64 bit processor.
While at make tools command it seems that Qemu installs successfully, but I can following error messages of "missing openssl" or "python-dev"

Any ideas what dependency causes this error?

I also tried to configure Xen from this link, but no luck from this too...


Thanks in advance for help!


The error log from compiling the libSDL test is:
/tmp/qemu-conf-3098-29270-608.c:1:17: error: SDL.h: No such file or directory
/tmp/qemu-conf-3098-29270-608.c: In function âmainâ:
/tmp/qemu-conf-3098-29270-608.c:3: error: âSDL_INIT_VIDEOâ undeclared (first use in this function)
/tmp/qemu-conf-3098-29270-608.c:3: error: (Each undeclared identifier is reported only once
/tmp/qemu-conf-3098-29270-608.c:3: error: for each function it appears in.)
qemu successfuly configured for Xen qemu-dm build
make[1]: Leaving directory `/usr/src/xen-3.4-testing.hg/tools'
make -C tools install
make[1]: Entering directory `/usr/src/xen-3.4-testing.hg/tools'
make[2]: Entering directory `/usr/src/xen-3.4-testing.hg/tools'
make -C check install
make[3]: Entering directory `/usr/src/xen-3.4-testing.hg/tools/check'
Xen CHECK-BUILD  Sun Mar 14 19:51:48 GMT 2010
Checking check_crypto_lib: OK
Checking check_curl: unused, OK
Checking check_openssl_devel:
 *** check_openssl_devel FAILED: missing openssl headers
Checking check_python: OK
Checking check_python_devel:
 *** check_python_devel FAILED: can't find python devel files
Checking check_x11_devel:
 *** check_x11_devel FAILED: can't find X11 headers
Checking check_xgettext: OK
Checking check_xml2: unused, OK
Checking check_zlib_devel:
 *** check_zlib_devel FAILED: can't find zlib headers
Checking check_zlib_lib: OK
make[3]: *** [check-build] Error 1
make[3]: Leaving directory `/usr/src/xen-3.4-testing.hg/tools/check'
make[2]: *** [subdir-install-check] Error 2
make[2]: Leaving directory `/usr/src/xen-3.4-testing.hg/tools'
make[1]: *** [subdirs-install] Error 2
make[1]: Leaving directory `/usr/src/xen-3.4-testing.hg/tools'
make: *** [install-tools] Error 2

Xen-users mailing list



Lists.xenproject.org is hosted with RackSpace, monitoring our
servers 24x7x365 and backed by RackSpace's Fanatical Support®.